Reaction Details
TargetCoproporphyrinogen III oxidase
LigandBDBM50414819
Substrate/Competitorn/a
Meas. Tech.ChEMBL_588025 (CHEMBL1048360)
Ki 44.67±n/a nM
Citation Zhang, LHao, GFTan, YXi, ZHuang, MZYang, GF Bioactive conformation analysis of cyclic imides as protoporphyrinogen oxidase inhibitor by combining DFT calculations, QSAR and molecular dynamic simulations. Bioorg Med Chem17:4935-42 (2009) 
 
Coproporphyrinogen III oxidase
Name:Coproporphyrinogen III oxidase
Type:PROTEIN
Mol. Mass.:51210.88
Organism:Bacillus subtilis (strain 168)
Description:ChEMBL_588025
Residue:470
BDBM50414819
NameBDBM50414819
Synonyms:CHEMBL572510
TypeSmall organic molecule
Emp. Form.C22H23FN2O6
Mol. Mass.430.4262
SMILESCCOC(=O)C(CC)N1C(=O)COc2cc(F)c(cc12)N1C(=O)C2=C(CCCC2)C1=O