Reaction Details
TargetCoproporphyrinogen III oxidase
LigandBDBM50414829
Substrate/Competitorn/a
Meas. Tech.ChEMBL_588025 (CHEMBL1048360)
Ki 870.96±n/a nM
Citation Zhang, LHao, GFTan, YXi, ZHuang, MZYang, GF Bioactive conformation analysis of cyclic imides as protoporphyrinogen oxidase inhibitor by combining DFT calculations, QSAR and molecular dynamic simulations. Bioorg Med Chem17:4935-42 (2009) 
 
Coproporphyrinogen III oxidase
Name:Coproporphyrinogen III oxidase
Type:PROTEIN
Mol. Mass.:51210.88
Organism:Bacillus subtilis (strain 168)
Description:ChEMBL_588025
Residue:470
BDBM50414829
NameBDBM50414829
Synonyms:CHEMBL575006
TypeSmall organic molecule
Emp. Form.C19H19Cl2FN2O3
Mol. Mass.413.27
SMILESCC(C)(CCl)C(=O)Nc1cc(N2C(=O)C3=C(CCCC3)C2=O)c(F)cc1Cl