Reaction Details
TargetCoproporphyrinogen III oxidase
LigandBDBM50414835
Substrate/Competitorn/a
Meas. Tech.ChEMBL_588025 (CHEMBL1048360)
Ki 89.13±n/a nM
Citation Zhang, LHao, GFTan, YXi, ZHuang, MZYang, GF Bioactive conformation analysis of cyclic imides as protoporphyrinogen oxidase inhibitor by combining DFT calculations, QSAR and molecular dynamic simulations. Bioorg Med Chem17:4935-42 (2009) 
 
Coproporphyrinogen III oxidase
Name:Coproporphyrinogen III oxidase
Type:PROTEIN
Mol. Mass.:51210.88
Organism:Bacillus subtilis (strain 168)
Description:ChEMBL_588025
Residue:470
BDBM50414835
NameBDBM50414835
Synonyms:CHEMBL578034
TypeSmall organic molecule
Emp. Form.C22H17ClFN3O4
Mol. Mass.441.839
SMILESFc1cc(Cl)c(NC(=O)NC(=O)c2ccccc2)cc1N1C(=O)C2=C(CCCC2)C1=O