Reaction Details
TargetCoproporphyrinogen III oxidase
LigandBDBM50414838
Substrate/Competitorn/a
Meas. Tech.ChEMBL_588025 (CHEMBL1048360)
Ki 6165.95±n/a nM
Citation Zhang, LHao, GFTan, YXi, ZHuang, MZYang, GF Bioactive conformation analysis of cyclic imides as protoporphyrinogen oxidase inhibitor by combining DFT calculations, QSAR and molecular dynamic simulations. Bioorg Med Chem17:4935-42 (2009) 
 
Coproporphyrinogen III oxidase
Name:Coproporphyrinogen III oxidase
Type:PROTEIN
Mol. Mass.:51210.88
Organism:Bacillus subtilis (strain 168)
Description:ChEMBL_588025
Residue:470
BDBM50414838
NameBDBM50414838
Synonyms:CHEMBL576355
TypeSmall organic molecule
Emp. Form.C22H18ClN3O4
Mol. Mass.423.849
SMILESClc1ccc(cc1NC(=O)NC(=O)c1ccccc1)N1C(=O)C2=C(CCCC2)C1=O