Reaction Details
TargetD(3) dopamine receptor
LigandBDBM50414840
Substrate/Competitorn/a
Meas. Tech.ChEMBL_590247 (CHEMBL1059284)
Ki 200±n/a nM
Citation Carro, LRaviña, EDomínguez, EBrea, JLoza, MIMasaguer, CF Synthesis and binding affinity of potential atypical antipsychotics with the tetrahydroquinazolinone motif. Bioorg Med Chem Lett19:6059-62 (2009) 
 
D(3) dopamine receptor
Name:D(3) dopamine receptor
Type:n/a
Mol. Mass.:44243.43
Organism:Homo sapiens (Human)
Description:n/a
Residue:400
BDBM50414840
NameBDBM50414840
Synonyms:CHEMBL576756
TypeSmall organic molecule
Emp. Form.C22H24FN5O2
Mol. Mass.409.4567
SMILESCNc1ncc2C(=O)CC(CN3CCC(CC3)c3noc4cc(F)ccc34)Cc2n1