Reaction Details
TargetNeuropeptide FF receptor 1
LigandBDBM50414853
Substrate/Competitorn/a
Meas. Tech.ChEMBL_590511 (CHEMBL1058558)
EC50 158.49±n/a nM
Citation Gaubert, GBertozzi, FKelly, NMPawlas, JScully, ALNash, NRGardell, LRLameh, JOlsson, R Discovery of selective nonpeptidergic neuropeptide FF2 receptor agonists. J Med Chem52:6511-4 (2009) 
 
Neuropeptide FF receptor 1
Name:Neuropeptide FF receptor 1
Type:PROTEIN
Mol. Mass.:47840.07
Organism:Homo sapiens (Human)
Description:ChEMBL_1474637
Residue:430
BDBM50414853
NameBDBM50414853
Synonyms:CHEMBL572825
TypeSmall organic molecule
Emp. Form.C15H18N4O
Mol. Mass.270.3296
SMILES[#6]-[#6](-[#6])-c1ccccc1-c1ccc(-[#6]=[#7]\[#7]=[#6](\[#7])-[#7])o1