Reaction Details
TargetEukaryotic translation initiation factor 2-alpha kinase 1
LigandBDBM50414882
Substrate/Competitorn/a
Meas. Tech.ChEMBL_589403 (CHEMBL1058424)
IC50 501.19±n/a nM
Citation Rosen, MDWoods, CRGoldberg, SDHack, MDBounds, ADYang, YWagaman, PCPhuong, VKAmeriks, APBarrett, TDKanelakis, KCChuang, JCChang, JShankley, NPRabinowitz, MH Discovery of the first known small-molecule inhibitors of heme-regulated eukaryotic initiation factor 2alpha (HRI) kinase. Bioorg Med Chem Lett19:6548-51 (2009) 
 
Eukaryotic translation initiation factor 2-alpha kinase 1
Name:Eukaryotic translation initiation factor 2-alpha kinase 1
Type:PROTEIN
Mol. Mass.:71098.55
Organism:Homo sapiens (Human)
Description:ChEMBL_1467744
Residue:630
BDBM50414882
NameBDBM50414882
Synonyms:CHEMBL582642
TypeSmall organic molecule
Emp. Form.C19H18ClN3O2S
Mol. Mass.387.883
SMILESCOc1cc2sc3c(NCc4c(C)cccc4Cl)[nH]nc3c2cc1OC