Reaction Details
TargetEukaryotic translation initiation factor 2-alpha kinase 1
LigandBDBM50414883
Substrate/Competitorn/a
Meas. Tech.ChEMBL_589403 (CHEMBL1058424)
IC50 316.23±n/a nM
Citation Rosen, MDWoods, CRGoldberg, SDHack, MDBounds, ADYang, YWagaman, PCPhuong, VKAmeriks, APBarrett, TDKanelakis, KCChuang, JCChang, JShankley, NPRabinowitz, MH Discovery of the first known small-molecule inhibitors of heme-regulated eukaryotic initiation factor 2alpha (HRI) kinase. Bioorg Med Chem Lett19:6548-51 (2009) 
 
Eukaryotic translation initiation factor 2-alpha kinase 1
Name:Eukaryotic translation initiation factor 2-alpha kinase 1
Type:PROTEIN
Mol. Mass.:71098.55
Organism:Homo sapiens (Human)
Description:ChEMBL_1467744
Residue:630
BDBM50414883
NameBDBM50414883
Synonyms:CHEMBL576948
TypeSmall organic molecule
Emp. Form.C20H20ClN3
Mol. Mass.337.846
SMILESCCc1ccc2Cc3c(NCc4c(C)cccc4Cl)[nH]nc3-c2c1