Reaction Details
TargetEukaryotic translation initiation factor 2-alpha kinase 1
LigandBDBM50414891
Substrate/Competitorn/a
Meas. Tech.ChEMBL_589403 (CHEMBL1058424)
IC50 31.62±n/a nM
Citation Rosen, MDWoods, CRGoldberg, SDHack, MDBounds, ADYang, YWagaman, PCPhuong, VKAmeriks, APBarrett, TDKanelakis, KCChuang, JCChang, JShankley, NPRabinowitz, MH Discovery of the first known small-molecule inhibitors of heme-regulated eukaryotic initiation factor 2alpha (HRI) kinase. Bioorg Med Chem Lett19:6548-51 (2009) 
 
Eukaryotic translation initiation factor 2-alpha kinase 1
Name:Eukaryotic translation initiation factor 2-alpha kinase 1
Type:PROTEIN
Mol. Mass.:71098.55
Organism:Homo sapiens (Human)
Description:ChEMBL_1467744
Residue:630
BDBM50414891
NameBDBM50414891
Synonyms:CHEMBL574005
TypeSmall organic molecule
Emp. Form.C21H21Cl2N3O4
Mol. Mass.450.315
SMILESCOc1cc-2c(Cc3c(NCc4c(Cl)cccc4Cl)[nH]nc-23)cc1OCC(O)CO