Reaction Details
TargetC-C chemokine receptor type 8
LigandBDBM50414964
Substrate/Competitorn/a
Meas. Tech.ChEMBL_594037 (CHEMBL1045844)
IC50 11.48±n/a nM
Citation Shamovsky, Ide Graaf, CAlderin, LBengtsson, MBladh, HBörjesson, LConnolly, SDyke, HJvan den Heuvel, MJohansson, HJosefsson, BGKristoffersson, ALinnanen, TLisius, AMännikkö, RNordén, BPrice, SRipa, LRognan, DRosendahl, ASkrinjar, MUrbahns, K Increasing selectivity of CC chemokine receptor 8 antagonists by engineering nondesolvation related interactions with the intended and off-target binding sites. J Med Chem52:7706-23 (2009) 
 
C-C chemokine receptor type 8
Name:C-C chemokine receptor type 8
Type:PROTEIN
Mol. Mass.:40855.53
Organism:Homo sapiens (Human)
Description:ChEMBL_454278
Residue:355
BDBM50414964
NameBDBM50414964
Synonyms:CHEMBL271128
TypeSmall organic molecule
Emp. Form.C29H33N3O3
Mol. Mass.471.5906
SMILESCOc1ccccc1Oc1ccccc1CN1CCC2(CC1)CCN(CC2)C(=O)c1ccncc1