Reaction Details
TargetC-C chemokine receptor type 8
LigandBDBM50414967
Substrate/Competitorn/a
Meas. Tech.ChEMBL_594037 (CHEMBL1045844)
IC50 17.38±n/a nM
Citation Shamovsky, Ide Graaf, CAlderin, LBengtsson, MBladh, HBörjesson, LConnolly, SDyke, HJvan den Heuvel, MJohansson, HJosefsson, BGKristoffersson, ALinnanen, TLisius, AMännikkö, RNordén, BPrice, SRipa, LRognan, DRosendahl, ASkrinjar, MUrbahns, K Increasing selectivity of CC chemokine receptor 8 antagonists by engineering nondesolvation related interactions with the intended and off-target binding sites. J Med Chem52:7706-23 (2009) 
 
C-C chemokine receptor type 8
Name:C-C chemokine receptor type 8
Type:PROTEIN
Mol. Mass.:40855.53
Organism:Homo sapiens (Human)
Description:ChEMBL_454278
Residue:355
BDBM50414967
NameBDBM50414967
Synonyms:CHEMBL271801
TypeSmall organic molecule
Emp. Form.C28H31N3O2
Mol. Mass.441.5646
SMILESO=C(N1CCC2(CCN(Cc3cccc(Oc4ccccc4)c3)CC2)CC1)c1ccncc1