Reaction Details
TargetC-C chemokine receptor type 8
LigandBDBM50414986
Substrate/Competitorn/a
Meas. Tech.ChEMBL_594037 (CHEMBL1045844)
IC50 5.62±n/a nM
Citation Shamovsky, Ide Graaf, CAlderin, LBengtsson, MBladh, HBörjesson, LConnolly, SDyke, HJvan den Heuvel, MJohansson, HJosefsson, BGKristoffersson, ALinnanen, TLisius, AMännikkö, RNordén, BPrice, SRipa, LRognan, DRosendahl, ASkrinjar, MUrbahns, K Increasing selectivity of CC chemokine receptor 8 antagonists by engineering nondesolvation related interactions with the intended and off-target binding sites. J Med Chem52:7706-23 (2009) 
 
C-C chemokine receptor type 8
Name:C-C chemokine receptor type 8
Type:PROTEIN
Mol. Mass.:40855.53
Organism:Homo sapiens (Human)
Description:ChEMBL_454278
Residue:355
BDBM50414986
NameBDBM50414986
Synonyms:CHEMBL568522
TypeSmall organic molecule
Emp. Form.C27H34N4O2
Mol. Mass.446.5845
SMILESCC1(C)Oc2c(CN3CCC4(CC3)CCN(CC4)C(=O)c3ccnc(N)c3)cccc2C=C1