Reaction Details
TargetC-C chemokine receptor type 8
LigandBDBM50414975
Substrate/Competitorn/a
Meas. Tech.ChEMBL_594037 (CHEMBL1045844)
IC50 6.61±n/a nM
Citation Shamovsky, Ide Graaf, CAlderin, LBengtsson, MBladh, HBörjesson, LConnolly, SDyke, HJvan den Heuvel, MJohansson, HJosefsson, BGKristoffersson, ALinnanen, TLisius, AMännikkö, RNordén, BPrice, SRipa, LRognan, DRosendahl, ASkrinjar, MUrbahns, K Increasing selectivity of CC chemokine receptor 8 antagonists by engineering nondesolvation related interactions with the intended and off-target binding sites. J Med Chem52:7706-23 (2009) 
 
C-C chemokine receptor type 8
Name:C-C chemokine receptor type 8
Type:PROTEIN
Mol. Mass.:40855.53
Organism:Homo sapiens (Human)
Description:ChEMBL_454278
Residue:355
BDBM50414975
NameBDBM50414975
Synonyms:CHEMBL584087
TypeSmall organic molecule
Emp. Form.C25H32N4O3
Mol. Mass.436.5466
SMILESCC1(C)Oc2cccc(CN3CCC4(CC3)CCN(CC4)C(=O)c3ccnc(N)c3)c2O1