Reaction Details
TargetC-C chemokine receptor type 8
LigandBDBM50414980
Substrate/Competitorn/a
Meas. Tech.ChEMBL_594037 (CHEMBL1045844)
IC50 2.82±n/a nM
Citation Shamovsky, Ide Graaf, CAlderin, LBengtsson, MBladh, HBörjesson, LConnolly, SDyke, HJvan den Heuvel, MJohansson, HJosefsson, BGKristoffersson, ALinnanen, TLisius, AMännikkö, RNordén, BPrice, SRipa, LRognan, DRosendahl, ASkrinjar, MUrbahns, K Increasing selectivity of CC chemokine receptor 8 antagonists by engineering nondesolvation related interactions with the intended and off-target binding sites. J Med Chem52:7706-23 (2009) 
 
C-C chemokine receptor type 8
Name:C-C chemokine receptor type 8
Type:PROTEIN
Mol. Mass.:40855.53
Organism:Homo sapiens (Human)
Description:ChEMBL_454278
Residue:355
BDBM50414980
NameBDBM50414980
Synonyms:CHEMBL568294
TypeSmall organic molecule
Emp. Form.C29H40N4O2
Mol. Mass.476.6535
SMILESCC(C)(C)C1(C)Cc2c(O1)cccc2CN1CCC2(CC1)CCN(CC2)C(=O)c1ccc(N)cn1