Reaction Details
TargetD(3) dopamine receptor
LigandBDBM50414564
Substrate/Competitorn/a
Meas. Tech.ChEMBL_598588 (CHEMBL1044429)
Ki 25.12±n/a nM
Citation Bennacef, ISalinas, CABonasera, TAGunn, RNAudrain, HJakobsen, SNabulsi, NWeinzimmer, DCarson, REHuang, YHolmes, IMicheli, FHeidbreder, CGentile, GRossi, TLaruelle, M Dopamine D3 receptor antagonists: the quest for a potentially selective PET ligand. Part 3: Radiosynthesis and in vivo studies. Bioorg Med Chem Lett19:5056-9 (2009) 
 
D(3) dopamine receptor
Name:D(3) dopamine receptor
Type:n/a
Mol. Mass.:44243.43
Organism:Homo sapiens (Human)
Description:n/a
Residue:400
BDBM50414564
NameBDBM50414564
Synonyms:CHEMBL562833
TypeSmall organic molecule
Emp. Form.C22H30ClN3O
Mol. Mass.387.946
SMILESCC1(C)[C@@H]2CC[C@]11CCN(CCN3CCN(C3=O)c3cccc(Cl)c3)C1C2