Reaction Details
TargetD(3) dopamine receptor
LigandBDBM50331549
Substrate/Competitorn/a
Meas. Tech.ChEMBL_598577 (CHEMBL1043569)
Ki 0.794±n/a nM
Citation Bennacef, ISalinas, CABonasera, TAGunn, RNAudrain, HJakobsen, SNabulsi, NWeinzimmer, DCarson, REHuang, YHolmes, IMicheli, FHeidbreder, CGentile, GRossi, TLaruelle, M Dopamine D3 receptor antagonists: the quest for a potentially selective PET ligand. Part 3: Radiosynthesis and in vivo studies. Bioorg Med Chem Lett19:5056-9 (2009) 
 
D(3) dopamine receptor
Name:D(3) dopamine receptor
Type:Protein
Mol. Mass.:49540.58
Organism:Rattus norvegicus (Rat)
Description:P19020
Residue:446
BDBM50331549
NameBDBM50331549
Synonyms:CHEMBL567286 | [11C]-3-(2-oxo-3-(2-(4-(trifluoromethyl)piperidin-1-yl)ethyl)imidazolidin-1-yl)benzonitrile
TypeSmall organic molecule
Emp. Form.C18H21F3N4O
Mol. Mass.366.3807
SMILESFC(F)(F)C1CCN(CCN2CCN(C2=O)c2cccc(c2)C#N)CC1