Reaction Details
TargetD(3) dopamine receptor
LigandBDBM50414572
Substrate/Competitorn/a
Meas. Tech.ChEMBL_598588 (CHEMBL1044429)
Ki 2.51±n/a nM
Citation Bennacef, ISalinas, CABonasera, TAGunn, RNAudrain, HJakobsen, SNabulsi, NWeinzimmer, DCarson, REHuang, YHolmes, IMicheli, FHeidbreder, CGentile, GRossi, TLaruelle, M Dopamine D3 receptor antagonists: the quest for a potentially selective PET ligand. Part 3: Radiosynthesis and in vivo studies. Bioorg Med Chem Lett19:5056-9 (2009) 
 
D(3) dopamine receptor
Name:D(3) dopamine receptor
Type:n/a
Mol. Mass.:44243.43
Organism:Homo sapiens (Human)
Description:n/a
Residue:400
BDBM50414572
NameBDBM50414572
Synonyms:CHEMBL563860
TypeSmall organic molecule
Emp. Form.C17H22ClN3O
Mol. Mass.319.829
SMILESClc1cccc(c1)N1CCN(CCN2C[C@H]3CC[C@@H]2C3)C1=O