Reaction Details
TargetD(2) dopamine receptor
LigandBDBM50414554
Substrate/Competitorn/a
Meas. Tech.ChEMBL_598589 (CHEMBL1044430)
Ki 15.85±n/a nM
Citation Bennacef, ISalinas, CABonasera, TAGunn, RNAudrain, HJakobsen, SNabulsi, NWeinzimmer, DCarson, REHuang, YHolmes, IMicheli, FHeidbreder, CGentile, GRossi, TLaruelle, M Dopamine D3 receptor antagonists: the quest for a potentially selective PET ligand. Part 3: Radiosynthesis and in vivo studies. Bioorg Med Chem Lett19:5056-9 (2009) 
 
D(2) dopamine receptor
Name:D(2) dopamine receptor
Type:Cell-surface receptors
Mol. Mass.:50647.10
Organism:Homo sapiens (Human)
Description:P14416
Residue:443
BDBM50414554
NameBDBM50414554
Synonyms:CHEMBL551927
TypeSmall organic molecule
Emp. Form.C25H30ClN3O
Mol. Mass.423.978
SMILESC[C@]12C[C@H](CC(C1)c1ccccc1)N(CCN1CCN(C1=O)c1cccc(Cl)c1)C2