Reaction Details
TargetcAMP-specific 3',5'-cyclic phosphodiesterase 4B
LigandBDBM50414989
Substrate/Competitorn/a
Meas. Tech.ChEMBL_599733 (CHEMBL1048177)
IC50 3.16±n/a nM
Citation Woodrow, MDBallantine, SPBarker, MDClarke, BJDawson, JDean, TWDelves, CJEvans, BGough, SLGuntrip, SBHolman, SHolmes, DSKranz, MLindvaal, MKLucas, FSNeu, MRanshaw, LESolanke, YESomers, DOWard, PWiseman, JO Quinolines as a novel structural class of potent and selective PDE4 inhibitors. Optimisation for inhaled administration. Bioorg Med Chem Lett19:5261-5 (2009) 
 
cAMP-specific 3',5'-cyclic phosphodiesterase 4B
Name:cAMP-specific 3',5'-cyclic phosphodiesterase 4B
Type:Protein
Mol. Mass.:83318.87
Organism:Homo sapiens (Human)
Description:Q07343
Residue:736
BDBM50414989
NameBDBM50414989
Synonyms:CHEMBL585937
TypeSmall organic molecule
Emp. Form.C22H23N3O4S
Mol. Mass.425.501
SMILESCOc1cccc(Nc2c(cnc3ccc(cc23)S(=O)(=O)C2CCCC2)C(N)=O)c1