Reaction Details
TargetAndrogen receptor
LigandBDBM50415098
Substrate/Competitorn/a
Meas. Tech.ChEMBL_597011 (CHEMBL1041855)
EC50 15.85±n/a nM
Citation Schlienger, NLund, BWPawlas, JBadalassi, FBertozzi, FLewinsky, RFejzic, AThygesen, MBTabatabaei, ABradley, SRGardell, LRPiu, FOlsson, R Synthesis, structure-activity relationships, and characterization of novel nonsteroidal and selective androgen receptor modulators. J Med Chem52:7186-91 (2009) 
 
Androgen receptor
Name:Androgen receptor
Type:PROTEIN
Mol. Mass.:98196.62
Organism:Mus musculus
Description:ChEMBL_945930
Residue:899
BDBM50415098
NameBDBM50415098
Synonyms:CHEMBL570898
TypeSmall organic molecule
Emp. Form.C15H14N2
Mol. Mass.222.2851
SMILESN#Cc1ccc(N2CCCC2)c2ccccc12