Reaction Details
TargetCannabinoid receptor 2
LigandBDBM50415104
Substrate/Competitorn/a
Meas. Tech.ChEMBL_597715 (CHEMBL1043502)
EC50 1258.93±n/a nM
Citation Gleave, RJBeswick, PJBrown, AJGiblin, GMHaslam, CPLivermore, DMoses, ANicholson, NHPage, LWSlingsby, BSwarbrick, ME 2-Amino-5-aryl-pyridines as selective CB2 agonists: synthesis and investigation of structure-activity relationships. Bioorg Med Chem Lett19:6578-81 (2009) 
 
Cannabinoid receptor 2
Name:Cannabinoid receptor 2
Type:G Protein-Coupled Receptor (GPCR)
Mol. Mass.:39690.94
Organism:Homo sapiens (Human)
Description:P34972
Residue:360
BDBM50415104
NameBDBM50415104
Synonyms:CHEMBL570201
TypeSmall organic molecule
Emp. Form.C18H23N3
Mol. Mass.281.3953
SMILESCc1cnc(c(C)c1)-c1ccc(nc1)N1CCCCCC1