Reaction Details
TargetCannabinoid receptor 2
LigandBDBM50415111
Substrate/Competitorn/a
Meas. Tech.ChEMBL_597715 (CHEMBL1043502)
EC50 79.43±n/a nM
Citation Gleave, RJBeswick, PJBrown, AJGiblin, GMHaslam, CPLivermore, DMoses, ANicholson, NHPage, LWSlingsby, BSwarbrick, ME 2-Amino-5-aryl-pyridines as selective CB2 agonists: synthesis and investigation of structure-activity relationships. Bioorg Med Chem Lett19:6578-81 (2009) 
 
Cannabinoid receptor 2
Name:Cannabinoid receptor 2
Type:G Protein-Coupled Receptor (GPCR)
Mol. Mass.:39690.94
Organism:Homo sapiens (Human)
Description:P34972
Residue:360
BDBM50415111
NameBDBM50415111
Synonyms:CHEMBL570683
TypeSmall organic molecule
Emp. Form.C22H25Cl2N3O2
Mol. Mass.434.359
SMILESClc1cccc(-c2cnc(N3CCCCCC3)c(c2)C(=O)N2CCOCC2)c1Cl