Reaction Details
TargetCannabinoid receptor 2
LigandBDBM50415117
Substrate/Competitorn/a
Meas. Tech.ChEMBL_597715 (CHEMBL1043502)
EC50 3981.07±n/a nM
Citation Gleave, RJBeswick, PJBrown, AJGiblin, GMHaslam, CPLivermore, DMoses, ANicholson, NHPage, LWSlingsby, BSwarbrick, ME 2-Amino-5-aryl-pyridines as selective CB2 agonists: synthesis and investigation of structure-activity relationships. Bioorg Med Chem Lett19:6578-81 (2009) 
 
Cannabinoid receptor 2
Name:Cannabinoid receptor 2
Type:G Protein-Coupled Receptor (GPCR)
Mol. Mass.:39690.94
Organism:Homo sapiens (Human)
Description:P34972
Residue:360
BDBM50415117
NameBDBM50415117
Synonyms:CHEMBL570415
TypeSmall organic molecule
Emp. Form.C18H17Cl2N3
Mol. Mass.346.254
SMILESClc1cccc(c1Cl)-c1cnc(N2CCCCCC2)c(c1)C#N