Reaction Details
TargetCannabinoid receptor 2
LigandBDBM50415121
Substrate/Competitorn/a
Meas. Tech.ChEMBL_597715 (CHEMBL1043502)
EC50 630.96±n/a nM
Citation Gleave, RJBeswick, PJBrown, AJGiblin, GMHaslam, CPLivermore, DMoses, ANicholson, NHPage, LWSlingsby, BSwarbrick, ME 2-Amino-5-aryl-pyridines as selective CB2 agonists: synthesis and investigation of structure-activity relationships. Bioorg Med Chem Lett19:6578-81 (2009) 
 
Cannabinoid receptor 2
Name:Cannabinoid receptor 2
Type:G Protein-Coupled Receptor (GPCR)
Mol. Mass.:39690.94
Organism:Homo sapiens (Human)
Description:P34972
Residue:360
BDBM50415121
NameBDBM50415121
Synonyms:CHEMBL570682
TypeSmall organic molecule
Emp. Form.C15H14Cl2N2O
Mol. Mass.309.19
SMILESClc1ccc(Cl)c(c1)-c1ccc(nc1)N1CCOCC1