Reaction Details
TargetMuscarinic acetylcholine receptor M2
LigandBDBM50415145
Substrate/Competitorn/a
Meas. Tech.ChEMBL_596256 (CHEMBL1048032)
Ki 4.57±n/a nM
Citation Scapecchi, SNesi, MMatucci, RBellucci, CBuccioni, MDei, SGuandalini, LManetti, DMartelli, CMartini, EMarucci, GOrlandi, FRomanelli, MNTeodori, ECirilli, R Synthesis, affinity profile and functional activity of potent chiral muscarinic antagonists with a pyrrolidinylfuran structure. J Med Chem53:201-7 (2010) 
 
Muscarinic acetylcholine receptor M2
Name:Muscarinic acetylcholine receptor M2
Type:GPCR
Mol. Mass.:51730.61
Organism:Homo sapiens (Human)
Description:P08172
Residue:466
BDBM50415145
NameBDBM50415145
Synonyms:CHEMBL571121
TypeSmall organic molecule
Emp. Form.C22H29NO2
Mol. Mass.339.4712
SMILESCN1CCC[C@@H]1c1ccc(o1)[C@@](O)(C1CCCCC1)c1ccccc1