Reaction Details
TargetMuscarinic acetylcholine receptor M2
LigandBDBM50415157
Substrate/Competitorn/a
Meas. Tech.ChEMBL_596256 (CHEMBL1048032)
Ki 13.49±n/a nM
Citation Scapecchi, SNesi, MMatucci, RBellucci, CBuccioni, MDei, SGuandalini, LManetti, DMartelli, CMartini, EMarucci, GOrlandi, FRomanelli, MNTeodori, ECirilli, R Synthesis, affinity profile and functional activity of potent chiral muscarinic antagonists with a pyrrolidinylfuran structure. J Med Chem53:201-7 (2010) 
 
Muscarinic acetylcholine receptor M2
Name:Muscarinic acetylcholine receptor M2
Type:GPCR
Mol. Mass.:51730.61
Organism:Homo sapiens (Human)
Description:P08172
Residue:466
BDBM50415157
NameBDBM50415157
Synonyms:CHEMBL583027
TypeSmall organic molecule
Emp. Form.C23H26NO
Mol. Mass.332.4581
SMILESC[N+]1(C)CCCC1c1ccc(o1)C(c1ccccc1)c1ccccc1