Reaction Details
TargetMuscarinic acetylcholine receptor M3
LigandBDBM50415158
Substrate/Competitorn/a
Meas. Tech.ChEMBL_596257 (CHEMBL1048033)
Ki 8.91±n/a nM
Citation Scapecchi, SNesi, MMatucci, RBellucci, CBuccioni, MDei, SGuandalini, LManetti, DMartelli, CMartini, EMarucci, GOrlandi, FRomanelli, MNTeodori, ECirilli, R Synthesis, affinity profile and functional activity of potent chiral muscarinic antagonists with a pyrrolidinylfuran structure. J Med Chem53:201-7 (2010) 
 
Muscarinic acetylcholine receptor M3
Name:Muscarinic acetylcholine receptor M3
Type:Enzyme
Mol. Mass.:66151.03
Organism:Homo sapiens (Human)
Description:P20309
Residue:590
BDBM50415158
NameBDBM50415158
Synonyms:CHEMBL569712
TypeSmall organic molecule
Emp. Form.C23H32NO
Mol. Mass.338.5057
SMILESC[N+]1(C)CCCC1c1ccc(o1)C(C1CCCCC1)c1ccccc1