Reaction Details
TargetMuscarinic acetylcholine receptor M4
LigandBDBM50415153
Substrate/Competitorn/a
Meas. Tech.ChEMBL_596258 (CHEMBL1048034)
Ki 4.27±n/a nM
Citation Scapecchi, SNesi, MMatucci, RBellucci, CBuccioni, MDei, SGuandalini, LManetti, DMartelli, CMartini, EMarucci, GOrlandi, FRomanelli, MNTeodori, ECirilli, R Synthesis, affinity profile and functional activity of potent chiral muscarinic antagonists with a pyrrolidinylfuran structure. J Med Chem53:201-7 (2010) 
 
Muscarinic acetylcholine receptor M4
Name:Muscarinic acetylcholine receptor M4
Type:Enzyme Catalytic Domain
Mol. Mass.:53079.31
Organism:Homo sapiens (Human)
Description:Cholinergic, muscarinic M4 CHRM4 HUMAN M3::P08173
Residue:479
BDBM50415153
NameBDBM50415153
Synonyms:CHEMBL569307
TypeSmall organic molecule
Emp. Form.C23H32NO2
Mol. Mass.354.5051
SMILESC[N+]1(C)CCC[C@@H]1c1ccc(o1)[C@@](O)(C1CCCCC1)c1ccccc1