Reaction Details
TargetMuscarinic acetylcholine receptor M4
LigandBDBM50241132
Substrate/Competitorn/a
Meas. Tech.ChEMBL_596258 (CHEMBL1048034)
Ki 0.141±n/a nM
Citation Scapecchi, SNesi, MMatucci, RBellucci, CBuccioni, MDei, SGuandalini, LManetti, DMartelli, CMartini, EMarucci, GOrlandi, FRomanelli, MNTeodori, ECirilli, R Synthesis, affinity profile and functional activity of potent chiral muscarinic antagonists with a pyrrolidinylfuran structure. J Med Chem53:201-7 (2010) 
 
Muscarinic acetylcholine receptor M4
Name:Muscarinic acetylcholine receptor M4
Type:Enzyme Catalytic Domain
Mol. Mass.:53079.31
Organism:Homo sapiens (Human)
Description:Cholinergic, muscarinic M4 CHRM4 HUMAN M3::P08173
Residue:479
BDBM50241132
NameBDBM50241132
Synonyms:3-Hydroxy-2-phenyl-propionic acid 9-methyl-3-oxa-9-aza-tricyclo[3.3.1.0*2,4*]non-7-yl ester CHEMBL376897 Methyl scopolamine | N-METHYLSCOPOLAMINE
TypeSmall organic molecule
Emp. Form.C18H24NO4
Mol. Mass.318.3869
SMILESC[N+]1(C)[C@H]2C[C@@H](C[C@@H]1[C@H]1O[C@@H]21)OC(=O)[C@H](CO)c1ccccc1