Reaction Details
TargetSigma non-opioid intracellular receptor 1
LigandBDBM50064172
Substrate/Competitorn/a
Meas. Tech.ChEMBL_595183 (CHEMBL1040025)
Ki 0.589±n/a nM
Citation Piergentili, AAmantini, CDel Bello, FGiannella, MMattioli, LPalmery, MPerfumi, MPigini, MSantoni, GTucci, PZotti, MQuaglia, W Novel highly potent and selective sigma 1 receptor antagonists related to spipethiane. J Med Chem53:1261-9 (2010) 
 
Sigma non-opioid intracellular receptor 1
Name:Sigma non-opioid intracellular receptor 1
Type:Enzyme Catalytic Domain
Mol. Mass.:25124.85
Organism:Homo sapiens (Human)
Description:Q99720
Residue:223
BDBM50064172
NameBDBM50064172
Synonyms:1-benzylspiro[hexahydropyridine-4,2'-(3',4'-dihydro-2'H-thiochromene)] SPIPETHIANE
TypeSmall organic molecule
Emp. Form.C20H23NS
Mol. Mass.309.468
SMILESC(N1CCC2(CC1)CCc1ccccc1S2)c1ccccc1