Reaction Details
TargetAdenosine receptor A2b
LigandBDBM50415179
Substrate/Competitorn/a
Meas. Tech.ChEMBL_601035 (CHEMBL1069172)
Ki 38.9±n/a nM
Citation Balo, MCBrea, JCaamaño, OFernández, FGarcía-Mera, XLópez, CLoza, MINieto, MIRodríguez-Borges, JE Synthesis and pharmacological evaluation of novel 1- and 8-substituted-3-furfuryl xanthines as adenosine receptor antagonists. Bioorg Med Chem17:6755-60 (2009) 
 
Adenosine receptor A2b
Name:Adenosine receptor A2b
Type:G Protein-Coupled Receptor (GPCR)
Mol. Mass.:36341.22
Organism:Homo sapiens (Human)
Description:n/a
Residue:332
BDBM50415179
NameBDBM50415179
Synonyms:CHEMBL603861
TypeSmall organic molecule
Emp. Form.C21H20F2N4O4
Mol. Mass.430.4047
SMILESCOCCn1c(=O)n(Cc2ccco2)c2nc(Cc3c(F)cccc3F)n(C)c2c1=O