Reaction Details
TargetAdenosine receptor A2b
LigandBDBM50415189
Substrate/Competitorn/a
Meas. Tech.ChEMBL_601035 (CHEMBL1069172)
Ki 46.77±n/a nM
Citation Balo, MCBrea, JCaamaño, OFernández, FGarcía-Mera, XLópez, CLoza, MINieto, MIRodríguez-Borges, JE Synthesis and pharmacological evaluation of novel 1- and 8-substituted-3-furfuryl xanthines as adenosine receptor antagonists. Bioorg Med Chem17:6755-60 (2009) 
 
Adenosine receptor A2b
Name:Adenosine receptor A2b
Type:G Protein-Coupled Receptor (GPCR)
Mol. Mass.:36341.22
Organism:Homo sapiens (Human)
Description:n/a
Residue:332
BDBM50415189
NameBDBM50415189
Synonyms:CHEMBL595657
TypeSmall organic molecule
Emp. Form.C22H20F2N4O3
Mol. Mass.426.416
SMILESCn1c(Cc2c(F)cccc2F)nc2n(Cc3ccco3)c(=O)n(CC3CC3)c(=O)c12