Reaction Details
TargetAdenosine receptor A1
LigandBDBM50415181
Substrate/Competitorn/a
Meas. Tech.ChEMBL_601032 (CHEMBL1069169)
Ki 26.92±n/a nM
Citation Balo, MCBrea, JCaamaño, OFernández, FGarcía-Mera, XLópez, CLoza, MINieto, MIRodríguez-Borges, JE Synthesis and pharmacological evaluation of novel 1- and 8-substituted-3-furfuryl xanthines as adenosine receptor antagonists. Bioorg Med Chem17:6755-60 (2009) 
 
Adenosine receptor A1
Name:Adenosine receptor A1
Type:Protein
Mol. Mass.:36704.13
Organism:Rattus norvegicus (rat)
Description:n/a
Residue:326
BDBM50415181
NameBDBM50415181
Synonyms:CHEMBL596346
TypeSmall organic molecule
Emp. Form.C21H22N4O3
Mol. Mass.378.4244
SMILESCCCn1c(=O)n(Cc2ccco2)c2nc(Cc3ccccc3)n(C)c2c1=O