Reaction Details
TargetAdenosine receptor A2b
LigandBDBM50415178
Substrate/Competitorn/a
Meas. Tech.ChEMBL_601035 (CHEMBL1069172)
Ki 89.13±n/a nM
Citation Balo, MCBrea, JCaamaño, OFernández, FGarcía-Mera, XLópez, CLoza, MINieto, MIRodríguez-Borges, JE Synthesis and pharmacological evaluation of novel 1- and 8-substituted-3-furfuryl xanthines as adenosine receptor antagonists. Bioorg Med Chem17:6755-60 (2009) 
 
Adenosine receptor A2b
Name:Adenosine receptor A2b
Type:G Protein-Coupled Receptor (GPCR)
Mol. Mass.:36341.22
Organism:Homo sapiens (Human)
Description:n/a
Residue:332
BDBM50415178
NameBDBM50415178
Synonyms:CHEMBL594728
TypeSmall organic molecule
Emp. Form.C20H14F2N4O3
Mol. Mass.396.347
SMILESFc1cccc(F)c1Cc1nc2n(Cc3ccco3)c(=O)n(CC#C)c(=O)c2[nH]1