Reaction Details
TargetMuscarinic acetylcholine receptor M1
LigandBDBM50385682
Substrate/Competitorn/a
Meas. Tech.ChEMBL_605172 (CHEMBL1067394)
Ki 30200±n/a nM
Citation Piergentili, AQuaglia, WDel Bello, FGiannella, MPigini, MBarocelli, EBertoni, SMatucci, RNesi, MBruni, BDi Vaira, M Properly substituted 1,4-dioxane nucleus favours the selective M3 muscarinic receptor activation. Bioorg Med Chem17:8174-85 (2009) 
 
Muscarinic acetylcholine receptor M1
Name:Muscarinic acetylcholine receptor M1
Type:Protein
Mol. Mass.:51442.54
Organism:Homo sapiens (Human)
Description:P11229
Residue:460
BDBM50385682
NameBDBM50385682
Synonyms:CHEMBL390842
TypeSmall organic molecule
Emp. Form.C9H20NO2
Mol. Mass.174.2601
SMILESC[C@H]1COC[C@@H](C[N+](C)(C)C)O1