Reaction Details
TargetcAMP-specific 3',5'-cyclic phosphodiesterase 4B
LigandBDBM50415244
Substrate/Competitorn/a
Meas. Tech.ChEMBL_603064 (CHEMBL1047725)
IC50 0.631±n/a nM
Citation Lunniss, CEldred, CAston, NCraven, AGohil, KJudkins, BKeeling, SRanshaw, LRobinson, EShipley, TTrivedi, N Addressing species specific metabolism and solubility issues in a quinoline series of oral PDE4 inhibitors. Bioorg Med Chem Lett20:137-40 (2010) 
 
cAMP-specific 3',5'-cyclic phosphodiesterase 4B
Name:cAMP-specific 3',5'-cyclic phosphodiesterase 4B
Type:Protein
Mol. Mass.:83318.87
Organism:Homo sapiens (Human)
Description:Q07343
Residue:736
BDBM50415244
NameBDBM50415244
Synonyms:CHEMBL595054
TypeSmall organic molecule
Emp. Form.C15H13F2N5O3S
Mol. Mass.381.357
SMILESCS(=O)(=O)c1cc(F)c2NN=C(C(Nc3cncc(F)c3)c2c1)C(N)=O