Reaction Details
TargetCannabinoid receptor 2
LigandBDBM50415133
Substrate/Competitorn/a
Meas. Tech.ChEMBL_605640 (CHEMBL1070562)
EC50 79.43±n/a nM
Citation Gleave, RJBeswick, PJBrown, AJGiblin, GMGoldsmith, PHaslam, CPMitchell, WLNicholson, NHPage, LWPatel, SRoomans, SSlingsby, BPSwarbrick, ME Synthesis and evaluation of 3-amino-6-aryl-pyridazines as selective CB(2) agonists for the treatment of inflammatory pain. Bioorg Med Chem Lett20:465-8 (2010) 
 
Cannabinoid receptor 2
Name:Cannabinoid receptor 2
Type:G Protein-Coupled Receptor (GPCR)
Mol. Mass.:39690.94
Organism:Homo sapiens (Human)
Description:P34972
Residue:360
BDBM50415133
NameBDBM50415133
Synonyms:CHEMBL577347
TypeSmall organic molecule
Emp. Form.C15H14Cl2N2O
Mol. Mass.309.19
SMILESClc1cccc(c1Cl)-c1ccc(nc1)N1CCOCC1