Reaction Details
TargetCannabinoid receptor 2
LigandBDBM50415332
Substrate/Competitorn/a
Meas. Tech.ChEMBL_605640 (CHEMBL1070562)
EC50 1000±n/a nM
Citation Gleave, RJBeswick, PJBrown, AJGiblin, GMGoldsmith, PHaslam, CPMitchell, WLNicholson, NHPage, LWPatel, SRoomans, SSlingsby, BPSwarbrick, ME Synthesis and evaluation of 3-amino-6-aryl-pyridazines as selective CB(2) agonists for the treatment of inflammatory pain. Bioorg Med Chem Lett20:465-8 (2010) 
 
Cannabinoid receptor 2
Name:Cannabinoid receptor 2
Type:G Protein-Coupled Receptor (GPCR)
Mol. Mass.:39690.94
Organism:Homo sapiens (Human)
Description:P34972
Residue:360
BDBM50415332
NameBDBM50415332
Synonyms:CHEMBL611321
TypeSmall organic molecule
Emp. Form.C15H14F3N3O
Mol. Mass.309.2864
SMILESFC(F)(F)c1cccc(c1)-c1ccc(nn1)N1CCOCC1