Reaction Details
TargetCannabinoid receptor 2
LigandBDBM50415334
Substrate/Competitorn/a
Meas. Tech.ChEMBL_605640 (CHEMBL1070562)
EC50 158.49±n/a nM
Citation Gleave, RJBeswick, PJBrown, AJGiblin, GMGoldsmith, PHaslam, CPMitchell, WLNicholson, NHPage, LWPatel, SRoomans, SSlingsby, BPSwarbrick, ME Synthesis and evaluation of 3-amino-6-aryl-pyridazines as selective CB(2) agonists for the treatment of inflammatory pain. Bioorg Med Chem Lett20:465-8 (2010) 
 
Cannabinoid receptor 2
Name:Cannabinoid receptor 2
Type:G Protein-Coupled Receptor (GPCR)
Mol. Mass.:39690.94
Organism:Homo sapiens (Human)
Description:P34972
Residue:360
BDBM50415334
NameBDBM50415334
Synonyms:CHEMBL610489
TypeSmall organic molecule
Emp. Form.C16H13F6N3O
Mol. Mass.377.2843
SMILESFC(F)(F)c1cccc(-c2ccc(nn2)N2CCOCC2)c1C(F)(F)F