Reaction Details
TargetCannabinoid receptor 1
LigandBDBM50415309
Substrate/Competitorn/a
Meas. Tech.ChEMBL_605642 (CHEMBL1070564)
EC50>31622.78±n/a nM
Citation Gleave, RJBeswick, PJBrown, AJGiblin, GMGoldsmith, PHaslam, CPMitchell, WLNicholson, NHPage, LWPatel, SRoomans, SSlingsby, BPSwarbrick, ME Synthesis and evaluation of 3-amino-6-aryl-pyridazines as selective CB(2) agonists for the treatment of inflammatory pain. Bioorg Med Chem Lett20:465-8 (2010) 
 
Cannabinoid receptor 1
Name:Cannabinoid receptor 1
Type:G Protein-Coupled Receptor (GPCR)
Mol. Mass.:52868.96
Organism:Homo sapiens (Human)
Description:P21554
Residue:472
BDBM50415309
NameBDBM50415309
Synonyms:CHEMBL608700
TypeSmall organic molecule
Emp. Form.C14H13Cl2N3O2S
Mol. Mass.358.243
SMILESClc1cccc(c1Cl)-c1ccc(nn1)N1CCS(=O)(=O)CC1