Reaction Details
TargetCannabinoid receptor 1
LigandBDBM50415312
Substrate/Competitorn/a
Meas. Tech.ChEMBL_605642 (CHEMBL1070564)
EC50 6309.57±n/a nM
Citation Gleave, RJBeswick, PJBrown, AJGiblin, GMGoldsmith, PHaslam, CPMitchell, WLNicholson, NHPage, LWPatel, SRoomans, SSlingsby, BPSwarbrick, ME Synthesis and evaluation of 3-amino-6-aryl-pyridazines as selective CB(2) agonists for the treatment of inflammatory pain. Bioorg Med Chem Lett20:465-8 (2010) 
 
Cannabinoid receptor 1
Name:Cannabinoid receptor 1
Type:G Protein-Coupled Receptor (GPCR)
Mol. Mass.:52868.96
Organism:Homo sapiens (Human)
Description:P21554
Residue:472
BDBM50415312
NameBDBM50415312
Synonyms:CHEMBL594530
TypeSmall organic molecule
Emp. Form.C16H15Cl2N3
Mol. Mass.320.216
SMILESC[C@H]1C=C[C@@H](C)N1c1ccc(nn1)-c1cccc(Cl)c1Cl