Reaction Details
TargetCannabinoid receptor 1
LigandBDBM50415334
Substrate/Competitorn/a
Meas. Tech.ChEMBL_605642 (CHEMBL1070564)
EC50>31622.78±n/a nM
Citation Gleave, RJBeswick, PJBrown, AJGiblin, GMGoldsmith, PHaslam, CPMitchell, WLNicholson, NHPage, LWPatel, SRoomans, SSlingsby, BPSwarbrick, ME Synthesis and evaluation of 3-amino-6-aryl-pyridazines as selective CB(2) agonists for the treatment of inflammatory pain. Bioorg Med Chem Lett20:465-8 (2010) 
 
Cannabinoid receptor 1
Name:Cannabinoid receptor 1
Type:G Protein-Coupled Receptor (GPCR)
Mol. Mass.:52868.96
Organism:Homo sapiens (Human)
Description:P21554
Residue:472
BDBM50415334
NameBDBM50415334
Synonyms:CHEMBL610489
TypeSmall organic molecule
Emp. Form.C16H13F6N3O
Mol. Mass.377.2843
SMILESFC(F)(F)c1cccc(-c2ccc(nn2)N2CCOCC2)c1C(F)(F)F