Reaction Details
TargetCalcitonin gene-related peptide type 1 receptor
LigandBDBM50415338
Substrate/Competitorn/a
Meas. Tech.ChEMBL_608969 (CHEMBL1073111)
Ki 200±n/a nM
Citation Nichols, PLBrand, JBriggs, MD'Angeli, MFarge, JGarland, SLGoldsmith, PHutchings, RKilford, ILi, HYMacPherson, DNimmo, FSanderson, FDSehmi, SShuker, NSkidmore, JStott, MSweeting, JTajuddin, HTakle, AKTrani, GWall, IDWard, RWilson, DMWitty, D Potent oxadiazole CGRP receptor antagonists for the potential treatment of migraine. Bioorg Med Chem Lett20:1368-72 (2010) 
 
Calcitonin gene-related peptide type 1 receptor
Name:Calcitonin gene-related peptide type 1 receptor
Type:Enzyme Catalytic Domain
Mol. Mass.:52980.45
Organism:Homo sapiens (Human)
Description:Q16602
Residue:461
BDBM50415338
NameBDBM50415338
Synonyms:CHEMBL604539
TypeSmall organic molecule
Emp. Form.C21H20N6O3
Mol. Mass.404.4219
SMILESO=C(Cc1nnc(o1)-c1ccccc1)N1CCC(CC1)n1c2cccnc2[nH]c1=O