Reaction Details
TargetCalcitonin gene-related peptide type 1 receptor
LigandBDBM50415352
Substrate/Competitorn/a
Meas. Tech.ChEMBL_608969 (CHEMBL1073111)
Ki 3.98±n/a nM
Citation Nichols, PLBrand, JBriggs, MD'Angeli, MFarge, JGarland, SLGoldsmith, PHutchings, RKilford, ILi, HYMacPherson, DNimmo, FSanderson, FDSehmi, SShuker, NSkidmore, JStott, MSweeting, JTajuddin, HTakle, AKTrani, GWall, IDWard, RWilson, DMWitty, D Potent oxadiazole CGRP receptor antagonists for the potential treatment of migraine. Bioorg Med Chem Lett20:1368-72 (2010) 
 
Calcitonin gene-related peptide type 1 receptor
Name:Calcitonin gene-related peptide type 1 receptor
Type:Enzyme Catalytic Domain
Mol. Mass.:52980.45
Organism:Homo sapiens (Human)
Description:Q16602
Residue:461
BDBM50415352
NameBDBM50415352
Synonyms:CHEMBL600636
TypeSmall organic molecule
Emp. Form.C22H18ClF3N6O3
Mol. Mass.506.865
SMILESFC(F)(F)c1cc(Cl)cc(c1)-c1nnc(CC(=O)N2CCC(CC2)n2c3cccnc3[nH]c2=O)o1