Reaction Details
TargetCalcitonin gene-related peptide type 1 receptor
LigandBDBM50415360
Substrate/Competitorn/a
Meas. Tech.ChEMBL_608970 (CHEMBL1073112)
Ki 15.85±n/a nM
Citation Nichols, PLBrand, JBriggs, MD'Angeli, MFarge, JGarland, SLGoldsmith, PHutchings, RKilford, ILi, HYMacPherson, DNimmo, FSanderson, FDSehmi, SShuker, NSkidmore, JStott, MSweeting, JTajuddin, HTakle, AKTrani, GWall, IDWard, RWilson, DMWitty, D Potent oxadiazole CGRP receptor antagonists for the potential treatment of migraine. Bioorg Med Chem Lett20:1368-72 (2010) 
 
Calcitonin gene-related peptide type 1 receptor
Name:Calcitonin gene-related peptide type 1 receptor
Type:Enzyme Catalytic Domain
Mol. Mass.:52980.45
Organism:Homo sapiens (Human)
Description:Q16602
Residue:461
BDBM50415360
NameBDBM50415360
Synonyms:CHEMBL610062
TypeSmall organic molecule
Emp. Form.C28H32ClN7O3
Mol. Mass.550.052
SMILESCCN1CCC(CC1)c1cc(Cl)cc(c1)-c1nnc(CC(=O)N2CCC(CC2)n2c3cccnc3[nH]c2=O)o1