Reaction Details
TargetAcetylcholinesterase
LigandBDBM50415461
Substrate/Competitorn/a
Meas. Tech.ChEMBL_610788 (CHEMBL1068105)
IC50 6.17±n/a nM
Citation Fang, LJumpertz, SZhang, YAppenroth, DFleck, CMohr, KTränkle, CDecker, M Hybrid molecules from xanomeline and tacrine: enhanced tacrine actions on cholinesterases and muscarinic M1 receptors. J Med Chem53:2094-103 (2010) 
 
Acetylcholinesterase
Name:Acetylcholinesterase
Type:Enzyme
Mol. Mass.:71812.79
Organism:Electrophorus electricus (Electric eel)
Description:n/a
Residue:633
BDBM50415461
NameBDBM50415461
Synonyms:CHEMBL589352
TypeSmall organic molecule
Emp. Form.C37H54N6O3S
Mol. Mass.662.928
SMILESCN1CCC=C(C1)c1nsnc1OCCCOCCCCC(=O)NCCCCCCCCNc1c2CCCCc2nc2ccccc12