Reaction Details
TargetAcetylcholinesterase
LigandBDBM50415469
Substrate/Competitorn/a
Meas. Tech.ChEMBL_610788 (CHEMBL1068105)
IC50 10.72±n/a nM
Citation Fang, LJumpertz, SZhang, YAppenroth, DFleck, CMohr, KTränkle, CDecker, M Hybrid molecules from xanomeline and tacrine: enhanced tacrine actions on cholinesterases and muscarinic M1 receptors. J Med Chem53:2094-103 (2010) 
 
Acetylcholinesterase
Name:Acetylcholinesterase
Type:Enzyme
Mol. Mass.:71812.79
Organism:Electrophorus electricus (Electric eel)
Description:n/a
Residue:633
BDBM50415469
NameBDBM50415469
Synonyms:CHEMBL590055
TypeSmall organic molecule
Emp. Form.C31H42N6O3S
Mol. Mass.578.769
SMILESCN1CCC=C(C1)c1nsnc1OCCCOCCCC(=O)NCCCNc1c2CCCCc2nc2ccccc12