Reaction Details
TargetHistamine H4 receptor
LigandBDBM50415485
Substrate/Competitorn/a
Meas. Tech.ChEMBL_613511 (CHEMBL1072277)
Ki 9.33±n/a nM
Citation Smits, RAAdami, MIstyastono, EPZuiderveld, OPvan Dam, CMde Kanter, FJJongejan, ACoruzzi, GLeurs, Rde Esch, IJ Synthesis and QSAR of quinazoline sulfonamides as highly potent human histamine H4 receptor inverse agonists. J Med Chem53:2390-400 (2010) 
 
Histamine H4 receptor
Name:Histamine H4 receptor
Type:G Protein-Coupled Receptor (GPCR)
Mol. Mass.:44517.02
Organism:Homo sapiens (Human)
Description:Binding assays were using CHO cells stably expressing hH4R receptors.
Residue:390
BDBM50415485
NameBDBM50415485
Synonyms:CHEMBL591250
TypeSmall organic molecule
Emp. Form.C19H27ClN6O3S
Mol. Mass.454.974
SMILESCN1CCN(CC1)c1nc(NCCS(=O)(=O)N2CCOCC2)c2cc(Cl)ccc2n1