Reaction Details
TargetHistamine H4 receptor
LigandBDBM50412516
Substrate/Competitorn/a
Meas. Tech.ChEMBL_613511 (CHEMBL1072277)
Ki 33.88±n/a nM
Citation Smits, RAAdami, MIstyastono, EPZuiderveld, OPvan Dam, CMde Kanter, FJJongejan, ACoruzzi, GLeurs, Rde Esch, IJ Synthesis and QSAR of quinazoline sulfonamides as highly potent human histamine H4 receptor inverse agonists. J Med Chem53:2390-400 (2010) 
 
Histamine H4 receptor
Name:Histamine H4 receptor
Type:G Protein-Coupled Receptor (GPCR)
Mol. Mass.:44517.02
Organism:Homo sapiens (Human)
Description:Binding assays were using CHO cells stably expressing hH4R receptors.
Residue:390
BDBM50412516
NameBDBM50412516
Synonyms:CHEMBL509852 | VUF-10515
TypeSmall organic molecule
Emp. Form.C19H22ClN5S
Mol. Mass.387.929
SMILESCN1CCN(CC1)c1nc(NCc2sccc2C)c2cc(Cl)ccc2n1