Reaction Details
TargetHistamine H4 receptor
LigandBDBM50415498
Substrate/Competitorn/a
Meas. Tech.ChEMBL_613511 (CHEMBL1072277)
Ki 15.49±n/a nM
Citation Smits, RAAdami, MIstyastono, EPZuiderveld, OPvan Dam, CMde Kanter, FJJongejan, ACoruzzi, GLeurs, Rde Esch, IJ Synthesis and QSAR of quinazoline sulfonamides as highly potent human histamine H4 receptor inverse agonists. J Med Chem53:2390-400 (2010) 
 
Histamine H4 receptor
Name:Histamine H4 receptor
Type:G Protein-Coupled Receptor (GPCR)
Mol. Mass.:44517.02
Organism:Homo sapiens (Human)
Description:Binding assays were using CHO cells stably expressing hH4R receptors.
Residue:390
BDBM50415498
NameBDBM50415498
Synonyms:CHEMBL589782
TypeSmall organic molecule
Emp. Form.C21H24BrClN6O2S
Mol. Mass.539.876
SMILESCN1CCN(CC1)c1nc(NCCS(=O)(=O)Nc2ccccc2)c2cc(Br)c(Cl)cc2n1